Re: [Swift CI] Build Failure: 0. OSS - LLDB Incremental - OS X (master) (Release) #2061

Is this a flaky test?

**16:39:31** Command invoked: /Users/buildnode/jenkins/workspace/oss-lldb-incremental-osx/lldb/test/dotest.py --executable /Users/buildnode/jenkins/workspace/oss-lldb-incremental-osx/Ninja-ReleaseAssert/lldb-macosx-x86_64/CustomSwift-Release/lldb --server /Applications/Xcode-beta.app/Contents/Developer/../SharedFrameworks/LLDB.framework/Resources/debugserver --out-of-tree-debugserver --skip-category=watchpoint -C /Users/buildnode/jenkins/workspace/oss-lldb-incremental-osx/Ninja-ReleaseAssert/llvm-macosx-x86_64/bin/clang --build-dir /Users/buildnode/jenkins/workspace/oss-lldb-incremental-osx/Ninja-ReleaseAssert/lldb-macosx-x86_64/lldb-test-build.noindex -E -s 2018-07-24-14_32_06 --results-port 52526 -S fnmac --inferior -p TestProcessAttach.py /Users/buildnode/jenkins/workspace/oss-lldb-incremental-osx/lldb/packages/Python/lldbsuite/test --event-add-entries worker_index=11:int **16:39:31**
**16:39:31** Configuration: arch=x86_64 compiler=/Users/buildnode/jenkins/workspace/oss-lldb-incremental-osx/Ninja-ReleaseAssert/llvm-macosx-x86_64/bin/clang-6.0 **16:39:31** ---------------------------------------------------------------------- **16:39:31** Collected 3 tests **16:39:31**
**16:39:31** ====================================================================== **16:39:31** FAIL: test_attach_to_process_by_name (TestProcessAttach.ProcessAttachTestCase) **16:39:31**    Test attach by process name **16:39:31** ---------------------------------------------------------------------- **16:39:31** Traceback (most recent call last): **16:39:31**   File "/Users/buildnode/jenkins/workspace/oss-lldb-incremental-osx/lldb/packages/Python/lldbsuite/test/decorators.py", line 114, in wrapper **16:39:31**     func(*args, **kwargs) **16:39:31**   File "/Users/buildnode/jenkins/workspace/oss-lldb-incremental-osx/lldb/packages/Python/lldbsuite/test/functionalities/process_attach/TestProcessAttach.py", line 80, in test_attach_to_process_by_name **16:39:31**     self.runCmd("process attach -n " + exe_name) **16:39:31**   File "/Users/buildnode/jenkins/workspace/oss-lldb-incremental-osx/lldb/packages/Python/lldbsuite/test/lldbtest.py", line 2115, in runCmd **16:39:31**     msg if msg else CMD_MSG(cmd)) **16:39:31** AssertionError: False is not True : Command 'process attach -n ProcessAttach' returns successfully **16:39:31** Config=x86_64-/Users/buildnode/jenkins/workspace/oss-lldb-incremental-osx/Ninja-ReleaseAssert/llvm-macosx-x86_64/bin/clang-6.0 **16:39:31** ---------------------------------------------------------------------- **16:39:31** Ran 3 tests in 8.613s **16:39:31**
**16:39:31** RESULT: FAILED (2 passes, 1 failures, 0 errors, 0 skipped, 0 expected failures, 0 unexpected successes) **16:39:31** Session logs for test failures/errors/unexpected successes can be found in directory '2018-07-24-14_32_06' **16:39:31**
**16:39:31** [TestProcessAttach.py FAILED]