Package Manager PR linux bot consistently failing


(Ankit Aggarwal) #1

Hi,

There is a llvm test failing on linux bots:

https://ci.swift.org/job/swift-package-manager-PR-Linux/810/
https://ci.swift.org/job/swift-package-manager-PR-Linux/811/

···

--

330 out of 716 test suites processed - TestSwiftStructChangeRerun.py
Session logs for test failures/errors/unexpected successes will go into
directory '2017-02-08-11_40_01' Command invoked:
/home/buildnode/disk2/workspace/swift-package-manager-PR-Linux/lldb/test/dotest.py
--executable
/home/buildnode/disk2/workspace/swift-package-manager-PR-Linux/build/buildbot_linux/lldb-linux-x86_64/bin/lldb
--rerun-all-issues -C
/home/buildnode/disk2/workspace/swift-package-manager-PR-Linux/build/buildbot_linux/llvm-linux-x86_64/bin/clang
-s 2017-02-08-11_40_01 --results-port 45312 -S fnmac --inferior -p
TestWeakSelf.py
/home/buildnode/disk2/workspace/swift-package-manager-PR-Linux/lldb/packages/Python/lldbsuite/test
--event-add-entries worker_index=10:int Configuration: arch=x86_64
compiler=/home/buildnode/disk2/workspace/swift-package-manager-PR-Linux/build/buildbot_linux/llvm-linux-x86_64/bin/clang
----------------------------------------------------------------------
Collected 3 tests

FAIL: test_with_dwarf (lldbsuite.test.lldbtest.TestWeakSelf)
----------------------------------------------------------------------
Traceback (most recent call last): File
"/home/buildnode/disk2/workspace/swift-package-manager-PR-Linux/lldb/packages/Python/lldbsuite/test/lldbinline.py",
line 153, in __test_with_dwarf self.do_test() File
"/home/buildnode/disk2/workspace/swift-package-manager-PR-Linux/lldb/packages/Python/lldbsuite/test/lldbinline.py",
line 186, in do_test parser.handle_breakpoint(self, breakpoint_id) File
"/home/buildnode/disk2/workspace/swift-package-manager-PR-Linux/lldb/packages/Python/lldbsuite/test/lldbinline.py",
line 85, in handle_breakpoint
test.execute_user_command(breakpoint['command']) File
"/home/buildnode/disk2/workspace/swift-package-manager-PR-Linux/lldb/packages/Python/lldbsuite/test/lldbinline.py",
line 168, in execute_user_command exec(__command, globals(), locals()) File
"<string>", line 1, in <module> File
"/home/buildnode/disk2/workspace/swift-package-manager-PR-Linux/lldb/packages/Python/lldbsuite/test/lldbtest.py",
line 2251, in expect msg if msg else EXP_MSG(str, output, exe))
AssertionError: False is not True : Data type(s) displayed correctly
Config=x86_64-/home/buildnode/disk2/workspace/swift-package-manager-PR-Linux/build/buildbot_linux/llvm-linux-x86_64/bin/clang-4.0

FAIL: test_with_dwo (lldbsuite.test.lldbtest.TestWeakSelf)
----------------------------------------------------------------------
Traceback (most recent call last): File
"/home/buildnode/disk2/workspace/swift-package-manager-PR-Linux/lldb/packages/Python/lldbsuite/test/lldbinline.py",
line 159, in __test_with_dwo self.do_test() File
"/home/buildnode/disk2/workspace/swift-package-manager-PR-Linux/lldb/packages/Python/lldbsuite/test/lldbinline.py",
line 186, in do_test parser.handle_breakpoint(self, breakpoint_id) File
"/home/buildnode/disk2/workspace/swift-package-manager-PR-Linux/lldb/packages/Python/lldbsuite/test/lldbinline.py",
line 85, in handle_breakpoint
test.execute_user_command(breakpoint['command']) File
"/home/buildnode/disk2/workspace/swift-package-manager-PR-Linux/lldb/packages/Python/lldbsuite/test/lldbinline.py",
line 168, in execute_user_command exec(__command, globals(), locals()) File
"<string>", line 1, in <module> File
"/home/buildnode/disk2/workspace/swift-package-manager-PR-Linux/lldb/packages/Python/lldbsuite/test/lldbtest.py",
line 2251, in expect msg if msg else EXP_MSG(str, output, exe))
AssertionError: False is not True : Data type(s) displayed correctly
Config=x86_64-/home/buildnode/disk2/workspace/swift-package-manager-PR-Linux/build/buildbot_linux/llvm-linux-x86_64/bin/clang-4.0

FAIL: test_with_gmodules (lldbsuite.test.lldbtest.TestWeakSelf)
----------------------------------------------------------------------
Traceback (most recent call last): File
"/home/buildnode/disk2/workspace/swift-package-manager-PR-Linux/lldb/packages/Python/lldbsuite/test/lldbinline.py",
line 165, in __test_with_gmodules self.do_test() File
"/home/buildnode/disk2/workspace/swift-package-manager-PR-Linux/lldb/packages/Python/lldbsuite/test/lldbinline.py",
line 186, in do_test parser.handle_breakpoint(self, breakpoint_id) File
"/home/buildnode/disk2/workspace/swift-package-manager-PR-Linux/lldb/packages/Python/lldbsuite/test/lldbinline.py",
line 85, in handle_breakpoint
test.execute_user_command(breakpoint['command']) File
"/home/buildnode/disk2/workspace/swift-package-manager-PR-Linux/lldb/packages/Python/lldbsuite/test/lldbinline.py",
line 168, in execute_user_command exec(__command, globals(), locals()) File
"<string>", line 1, in <module> File
"/home/buildnode/disk2/workspace/swift-package-manager-PR-Linux/lldb/packages/Python/lldbsuite/test/lldbtest.py",
line 2251, in expect msg if msg else EXP_MSG(str, output, exe))
AssertionError: False is not True : Data type(s) displayed correctly
Config=x86_64-/home/buildnode/disk2/workspace/swift-package-manager-PR-Linux/build/buildbot_linux/llvm-linux-x86_64/bin/clang-4.0
---------------------------------------------------------------------- Ran
3 tests in 5.026s RESULT: FAILED (0 passes, 3 failures, 0 errors, 0
skipped, 0 expected failures, 0 unexpected successes) Session logs for test
failures/errors/unexpected successes can be found in directory
'2017-02-08-11_40_01' [TestWeakSelf.py FAILED] Command invoked:
/usr/bin/python
/home/buildnode/disk2/workspace/swift-package-manager-PR-Linux/lldb/test/dotest.py
--executable
/home/buildnode/disk2/workspace/swift-package-manager-PR-Linux/build/buildbot_linux/lldb-linux-x86_64/bin/lldb
--rerun-all-issues -C
/home/buildnode/disk2/workspace/swift-package-manager-PR-Linux/build/buildbot_linux/llvm-linux-x86_64/bin/clang
-s 2017-02-08-11_40_01 --results-port 45312 -S fnmac --inferior -p
TestWeakSelf.py
/home/buildnode/disk2/workspace/swift-package-manager-PR-Linux/lldb/packages/Python/lldbsuite/test
--event-add-entries worker_index=10:int 331 out of 716 test suites
processed - TestWeakSelf.py


(Jordan Rose) #2

[+swift-lldb-dev]

···

On Feb 8, 2017, at 04:16, Ankit Aggarwal via swift-dev <swift-dev@swift.org> wrote:

Hi,

There is a llvm test failing on linux bots:

https://ci.swift.org/job/swift-package-manager-PR-Linux/810/
https://ci.swift.org/job/swift-package-manager-PR-Linux/811/

--

330 out of 716 test suites processed - TestSwiftStructChangeRerun.py

Session logs for test failures/errors/unexpected successes will go into directory '2017-02-08-11_40_01'
Command invoked: /home/buildnode/disk2/workspace/swift-package-manager-PR-Linux/lldb/test/dotest.py --executable /home/buildnode/disk2/workspace/swift-package-manager-PR-Linux/build/buildbot_linux/lldb-linux-x86_64/bin/lldb --rerun-all-issues -C /home/buildnode/disk2/workspace/swift-package-manager-PR-Linux/build/buildbot_linux/llvm-linux-x86_64/bin/clang -s 2017-02-08-11_40_01 --results-port 45312 -S fnmac --inferior -p TestWeakSelf.py /home/buildnode/disk2/workspace/swift-package-manager-PR-Linux/lldb/packages/Python/lldbsuite/test --event-add-entries worker_index=10:int

Configuration: arch=x86_64 compiler=/home/buildnode/disk2/workspace/swift-package-manager-PR-Linux/build/buildbot_linux/llvm-linux-x86_64/bin/clang
----------------------------------------------------------------------
Collected 3 tests

======================================================================
FAIL: test_with_dwarf (lldbsuite.test.lldbtest.TestWeakSelf)
----------------------------------------------------------------------
Traceback (most recent call last):
  File "/home/buildnode/disk2/workspace/swift-package-manager-PR-Linux/lldb/packages/Python/lldbsuite/test/lldbinline.py", line 153, in __test_with_dwarf
    self.do_test()
  File "/home/buildnode/disk2/workspace/swift-package-manager-PR-Linux/lldb/packages/Python/lldbsuite/test/lldbinline.py", line 186, in do_test
    parser.handle_breakpoint(self, breakpoint_id)
  File "/home/buildnode/disk2/workspace/swift-package-manager-PR-Linux/lldb/packages/Python/lldbsuite/test/lldbinline.py", line 85, in handle_breakpoint
    test.execute_user_command(breakpoint['command'])
  File "/home/buildnode/disk2/workspace/swift-package-manager-PR-Linux/lldb/packages/Python/lldbsuite/test/lldbinline.py", line 168, in execute_user_command
    exec(__command, globals(), locals())
  File "<string>", line 1, in <module>
  File "/home/buildnode/disk2/workspace/swift-package-manager-PR-Linux/lldb/packages/Python/lldbsuite/test/lldbtest.py", line 2251, in expect
    msg if msg else EXP_MSG(str, output, exe))
AssertionError: False is not True : Data type(s) displayed correctly
Config=x86_64-/home/buildnode/disk2/workspace/swift-package-manager-PR-Linux/build/buildbot_linux/llvm-linux-x86_64/bin/clang-4.0

FAIL: test_with_dwo (lldbsuite.test.lldbtest.TestWeakSelf)
----------------------------------------------------------------------
Traceback (most recent call last):
  File "/home/buildnode/disk2/workspace/swift-package-manager-PR-Linux/lldb/packages/Python/lldbsuite/test/lldbinline.py", line 159, in __test_with_dwo
    self.do_test()
  File "/home/buildnode/disk2/workspace/swift-package-manager-PR-Linux/lldb/packages/Python/lldbsuite/test/lldbinline.py", line 186, in do_test
    parser.handle_breakpoint(self, breakpoint_id)
  File "/home/buildnode/disk2/workspace/swift-package-manager-PR-Linux/lldb/packages/Python/lldbsuite/test/lldbinline.py", line 85, in handle_breakpoint
    test.execute_user_command(breakpoint['command'])
  File "/home/buildnode/disk2/workspace/swift-package-manager-PR-Linux/lldb/packages/Python/lldbsuite/test/lldbinline.py", line 168, in execute_user_command
    exec(__command, globals(), locals())
  File "<string>", line 1, in <module>
  File "/home/buildnode/disk2/workspace/swift-package-manager-PR-Linux/lldb/packages/Python/lldbsuite/test/lldbtest.py", line 2251, in expect
    msg if msg else EXP_MSG(str, output, exe))
AssertionError: False is not True : Data type(s) displayed correctly
Config=x86_64-/home/buildnode/disk2/workspace/swift-package-manager-PR-Linux/build/buildbot_linux/llvm-linux-x86_64/bin/clang-4.0

FAIL: test_with_gmodules (lldbsuite.test.lldbtest.TestWeakSelf)
----------------------------------------------------------------------
Traceback (most recent call last):
  File "/home/buildnode/disk2/workspace/swift-package-manager-PR-Linux/lldb/packages/Python/lldbsuite/test/lldbinline.py", line 165, in __test_with_gmodules
    self.do_test()
  File "/home/buildnode/disk2/workspace/swift-package-manager-PR-Linux/lldb/packages/Python/lldbsuite/test/lldbinline.py", line 186, in do_test
    parser.handle_breakpoint(self, breakpoint_id)
  File "/home/buildnode/disk2/workspace/swift-package-manager-PR-Linux/lldb/packages/Python/lldbsuite/test/lldbinline.py", line 85, in handle_breakpoint
    test.execute_user_command(breakpoint['command'])
  File "/home/buildnode/disk2/workspace/swift-package-manager-PR-Linux/lldb/packages/Python/lldbsuite/test/lldbinline.py", line 168, in execute_user_command
    exec(__command, globals(), locals())
  File "<string>", line 1, in <module>
  File "/home/buildnode/disk2/workspace/swift-package-manager-PR-Linux/lldb/packages/Python/lldbsuite/test/lldbtest.py", line 2251, in expect
    msg if msg else EXP_MSG(str, output, exe))
AssertionError: False is not True : Data type(s) displayed correctly
Config=x86_64-/home/buildnode/disk2/workspace/swift-package-manager-PR-Linux/build/buildbot_linux/llvm-linux-x86_64/bin/clang-4.0
----------------------------------------------------------------------
Ran 3 tests in 5.026s

RESULT: FAILED (0 passes, 3 failures, 0 errors, 0 skipped, 0 expected failures, 0 unexpected successes)
Session logs for test failures/errors/unexpected successes can be found in directory '2017-02-08-11_40_01'

<>[TestWeakSelf.py FAILED]
Command invoked: /usr/bin/python /home/buildnode/disk2/workspace/swift-package-manager-PR-Linux/lldb/test/dotest.py --executable /home/buildnode/disk2/workspace/swift-package-manager-PR-Linux/build/buildbot_linux/lldb-linux-x86_64/bin/lldb --rerun-all-issues -C /home/buildnode/disk2/workspace/swift-package-manager-PR-Linux/build/buildbot_linux/llvm-linux-x86_64/bin/clang -s 2017-02-08-11_40_01 --results-port 45312 -S fnmac --inferior -p TestWeakSelf.py /home/buildnode/disk2/workspace/swift-package-manager-PR-Linux/lldb/packages/Python/lldbsuite/test --event-add-entries worker_index=10:int

331 out of 716 test suites processed - TestWeakSelf.py
_______________________________________________
swift-dev mailing list
swift-dev@swift.org
https://lists.swift.org/mailman/listinfo/swift-dev