Error building Swift


(Brandon Knope) #1

Hello! I am trying to build swift and I have installed both CMake and Ninja with MacPorts.

When running build-scripts, I am getting this error:


...
-- The C compiler identification is AppleClang 7.0.2.7000181
-- The CXX compiler identification is AppleClang 7.0.2.7000181
-- Check for working C compiler using: Ninja
CMake Error:
  The detected version of Ninja () is less than the version of Ninja required
  by CMake (1.3).

CMake Error: Internal CMake error, TryCompile generation of cmake failed
-- Check for working C compiler using: Ninja -- broken
CMake Error at /opt/local/share/cmake-3.4/Modules/CMakeTestCCompiler.cmake:61 (message):
  The C compiler
  "/Applications/Xcode.app/Contents/Developer/Toolchains/XcodeDefault.xctoolchain/usr/bin/clang"
  is not able to compile a simple test program.

  It fails with the following output:

  CMake will not be able to correctly generate this project.

I followed the directions from https://github.com/apple/swift.

Ninja should be the most current version as it was installed and updated via MacPorts.

Any ideas? Am I missing something silly?

Thanks,
Brandon


(Dmitri Gribenko) #2

Did you clone the ninja repository?

Dmitri

···

On Wed, Feb 17, 2016 at 1:42 PM, Brandon Knope via swift-users <swift-users@swift.org> wrote:

Hello! I am trying to build swift and I have installed both CMake and Ninja
with MacPorts.

When running build-scripts, I am getting this error:


...
-- The C compiler identification is AppleClang 7.0.2.7000181
-- The CXX compiler identification is AppleClang 7.0.2.7000181
-- Check for working C compiler using: Ninja
CMake Error:
  The detected version of Ninja () is less than the version of Ninja
required
  by CMake (1.3).

--
main(i,j){for(i=2;;i++){for(j=2;j<i;j++){if(!(i%j)){j=0;break;}}if
(j){printf("%d\n",i);}}} /*Dmitri Gribenko <gribozavr@gmail.com>*/


(Brandon Knope) #3

I installed it via MacPorts. Before going that route, I had cloned it and had the same problem

Brandon

···

On Feb 17, 2016, at 4:50 PM, Dmitri Gribenko <gribozavr@gmail.com> wrote:

On Wed, Feb 17, 2016 at 1:42 PM, Brandon Knope via swift-users > <swift-users@swift.org> wrote:

Hello! I am trying to build swift and I have installed both CMake and Ninja
with MacPorts.

When running build-scripts, I am getting this error:


...
-- The C compiler identification is AppleClang 7.0.2.7000181
-- The CXX compiler identification is AppleClang 7.0.2.7000181
-- Check for working C compiler using: Ninja
CMake Error:
The detected version of Ninja () is less than the version of Ninja
required
by CMake (1.3).

Did you clone the ninja repository?

Dmitri

--
main(i,j){for(i=2;;i++){for(j=2;j<i;j++){if(!(i%j)){j=0;break;}}if
(j){printf("%d\n",i);}}} /*Dmitri Gribenko <gribozavr@gmail.com>*/


(Dmitri Gribenko) #4

Could you post more of the build log? And the output of `which ninja`.

Dmitri

···

On Wed, Feb 17, 2016 at 1:53 PM, Brandon Knope <bknope@me.com> wrote:

I installed it via MacPorts. Before going that route, I had cloned it and had the same problem

--
main(i,j){for(i=2;;i++){for(j=2;j<i;j++){if(!(i%j)){j=0;break;}}if
(j){printf("%d\n",i);}}} /*Dmitri Gribenko <gribozavr@gmail.com>*/


(Brandon Knope) #5

Sure thing! I really appreciate the help!

Output:
"
bknope$ utils/build-script
Building the standard library for: swift-test-stdlib-macosx-x86_64

cmark: using standard linker
+ cd '/Users/bknope/Documents/Development/Home Dev/Swift Open Source/Git/build/Ninja-DebugAssert/cmark-macosx-x86_64'
+ /opt/local/bin/cmake -G Ninja -DCMAKE_C_COMPILER:PATH=/Applications/Xcode.app/Contents/Developer/Toolchains/XcodeDefault.xctoolchain/usr/bin/clang -DCMAKE_CXX_COMPILER:PATH=/Applications/Xcode.app/Contents/Developer/Toolchains/XcodeDefault.xctoolchain/usr/bin/clang++ -DCMAKE_BUILD_TYPE:STRING=Debug '-DCMAKE_C_FLAGS= ' '-DCMAKE_CXX_FLAGS= ' -DCMAKE_OSX_SYSROOT:PATH=/Applications/Xcode.app/Contents/Developer/Platforms/MacOSX.platform/Developer/SDKs/MacOSX10.11.sdk -DCMAKE_OSX_DEPLOYMENT_TARGET=10.9 '/Users/bknope/Documents/Development/Home Dev/Swift Open Source/Git/cmark'
-- The C compiler identification is AppleClang 7.0.2.7000181
-- The CXX compiler identification is AppleClang 7.0.2.7000181
-- Check for working C compiler using: Ninja
CMake Error:
  The detected version of Ninja () is less than the version of Ninja required
  by CMake (1.3).

CMake Error: Internal CMake error, TryCompile generation of cmake failed
-- Check for working C compiler using: Ninja -- broken
CMake Error at /opt/local/share/cmake-3.4/Modules/CMakeTestCCompiler.cmake:61 (message):
  The C compiler
  "/Applications/Xcode.app/Contents/Developer/Toolchains/XcodeDefault.xctoolchain/usr/bin/clang"
  is not able to compile a simple test program.

  It fails with the following output:

  CMake will not be able to correctly generate this project.
Call Stack (most recent call first):
  CMakeLists.txt:1 (project)

-- Configuring incomplete, errors occurred!
See also "/Users/bknope/Documents/Development/Home Dev/Swift Open Source/Git/build/Ninja-DebugAssert/cmark-macosx-x86_64/CMakeFiles/CMakeOutput.log".
See also "/Users/bknope/Documents/Development/Home Dev/Swift Open Source/Git/build/Ninja-DebugAssert/cmark-macosx-x86_64/CMakeFiles/CMakeError.log".
utils/build-script: command terminated with a non-zero exit status 1, aborting

which ninja output:
"
/opt/local/bin/ninja

···

On Feb 17, 2016, at 4:56 PM, Dmitri Gribenko <gribozavr@gmail.com> wrote:

On Wed, Feb 17, 2016 at 1:53 PM, Brandon Knope <bknope@me.com> wrote:

I installed it via MacPorts. Before going that route, I had cloned it and had the same problem

Could you post more of the build log? And the output of `which ninja`.

Dmitri

--
main(i,j){for(i=2;;i++){for(j=2;j<i;j++){if(!(i%j)){j=0;break;}}if
(j){printf("%d\n",i);}}} /*Dmitri Gribenko <gribozavr@gmail.com>*/


(Dmitri Gribenko) #6

'which' command reports that everything is fine, but CMake isn't
seeing ninja. Could you check out the ninja sources next to swift,
remove your 'build' directory, try again and post the output here?

Dmitri

···

On Wed, Feb 17, 2016 at 1:59 PM, Brandon Knope <bknope@me.com> wrote:

Sure thing! I really appreciate the help!

--
main(i,j){for(i=2;;i++){for(j=2;j<i;j++){if(!(i%j)){j=0;break;}}if
(j){printf("%d\n",i);}}} /*Dmitri Gribenko <gribozavr@gmail.com>*/


(Brandon Knope) #7

I cloned ninja again and I deleted the build folder. It looks like it’s getting stuck somewhere else now
"
++ cmake_config_opt llvm
++ product=llvm
++ [[ Ninja == \X\c\o\d\e ]]
+ /opt/local/bin/cmake --build '/Users/bknope/Documents/Development/Home Dev/SwiftOpenSource/Git/build/Ninja-DebugAssert/llvm-macosx-x86_64' -- -j8 all
[558/2025] Linking CXX shared module lib/LLVMHello.dylib
FAILED: : && /Applications/Xcode.app/Contents/Developer/Toolchains/XcodeDefault.xctoolchain/usr/bin/clang++ -stdlib=libc++ -fPIC -fvisibility-inlines-hidden -Wall -W -Wno-unused-parameter -Wwrite-strings -Wcast-qual -Wmissing-field-initializers -pedantic -Wno-long-long -Wcovered-switch-default -Wnon-virtual-dtor -Wdelete-non-virtual-dtor -std=c++11 -fcolor-diagnostics -g -isysroot /Applications/Xcode.app/Contents/Developer/Platforms/MacOSX.platform/Developer/SDKs/MacOSX10.11.sdk -mmacosx-version-min=10.9 -bundle -Wl,-headerpad_max_install_names -stdlib=libc++ -Wl,-flat_namespace -Wl,-undefined -Wl,suppress -Wl,-exported_symbols_list,/Users/bknope/Documents/Development/Home Dev/SwiftOpenSource/Git/build/Ninja-DebugAssert/llvm-macosx-x86_64/lib/Transforms/Hello/LLVMHello.exports -o lib/LLVMHello.dylib lib/Transforms/Hello/CMakeFiles/LLVMHello.dir/Hello.cpp.o -Wl,-rpath,@executable_path/../lib && :
clang: error: no such file or directory: 'Dev/SwiftOpenSource/Git/build/Ninja-DebugAssert/llvm-macosx-x86_64/lib/Transforms/Hello/LLVMHello.exports'
[558/2025] Building CXX object lib/Tra.../LLVMVectorize.dir/LoopVectorize.cpp.o
ninja: build stopped: subcommand failed.
utils/build-script: command terminated with a non-zero exit status 1, aborting

Brandon

···

On Feb 17, 2016, at 5:29 PM, Dmitri Gribenko <gribozavr@gmail.com> wrote:

On Wed, Feb 17, 2016 at 1:59 PM, Brandon Knope <bknope@me.com> wrote:

Sure thing! I really appreciate the help!

'which' command reports that everything is fine, but CMake isn't
seeing ninja. Could you check out the ninja sources next to swift,
remove your 'build' directory, try again and post the output here?

Dmitri

--
main(i,j){for(i=2;;i++){for(j=2;j<i;j++){if(!(i%j)){j=0;break;}}if
(j){printf("%d\n",i);}}} /*Dmitri Gribenko <gribozavr@gmail.com>*/


(Dmitri Gribenko) #8

Could you try with a directory that does not have spaces in the path?

Dmitri

···

On Wed, Feb 17, 2016 at 2:54 PM, Brandon Knope <bknope@me.com> wrote:

I cloned ninja again and I deleted the build folder. It looks like it’s
getting stuck somewhere else now

--
main(i,j){for(i=2;;i++){for(j=2;j<i;j++){if(!(i%j)){j=0;break;}}if
(j){printf("%d\n",i);}}} /*Dmitri Gribenko <gribozavr@gmail.com>*/


(Brandon Knope) #9

That looks like it did it! I say looks like because it is still building but it has gotten much much further than it ever has.

And the annoying thing is I had just changed “Swift Open Source” to “SwiftOpenSource” after the previous errors and I didn’t see the “Home Dev”.

Any reason why it wouldn’t like spaces?

Thanks a ton!
Brandon

···

On Feb 17, 2016, at 6:23 PM, Dmitri Gribenko <gribozavr@gmail.com> wrote:

On Wed, Feb 17, 2016 at 2:54 PM, Brandon Knope <bknope@me.com> wrote:

I cloned ninja again and I deleted the build folder. It looks like it’s
getting stuck somewhere else now

Could you try with a directory that does not have spaces in the path?

Dmitri

--
main(i,j){for(i=2;;i++){for(j=2;j<i;j++){if(!(i%j)){j=0;break;}}if
(j){printf("%d\n",i);}}} /*Dmitri Gribenko <gribozavr@gmail.com>*/


(Brandon Knope) #10

Quick update: I ran the command to build for Xcode:

utils/build-scripts -X

And it got some errors toward the end:


** BUILD FAILED **

The following build commands failed:
  PhaseScriptExecution CMake\ Rules /Users/bknope/Documents/Development/HomeDev/SwiftOpenSource/Git/build/Xcode-DebugAssert/swift-macosx-x86_64/Swift.build/Debug/xcode_generate_for_ide_only_dummy.build/Script-6DB688F4385B43DF935F22B2.sh
  CompileC /Users/bknope/Documents/Development/HomeDev/SwiftOpenSource/Git/build/Xcode-DebugAssert/swift-macosx-x86_64/lib/ClangImporter/Swift.build/Debug/swiftClangImporter.build/Objects-normal/x86_64/ImportDecl.o lib/ClangImporter/ImportDecl.cpp normal x86_64 c++ com.apple.compilers.llvm.clang.1_0.compiler
  Libtool /Users/bknope/Documents/Development/HomeDev/SwiftOpenSource/Git/build/Xcode-DebugAssert/swift-macosx-x86_64/Debug/lib/libswiftClangImporter.a normal x86_64
  Ld /Users/bknope/Documents/Development/HomeDev/SwiftOpenSource/Git/build/Xcode-DebugAssert/swift-macosx-x86_64/Debug/bin/swift-llvm-opt normal x86_64
  Ld /Users/bknope/Documents/Development/HomeDev/SwiftOpenSource/Git/build/Xcode-DebugAssert/swift-macosx-x86_64/Debug/bin/swift-ide-test normal x86_64
  Ld /Users/bknope/Documents/Development/HomeDev/SwiftOpenSource/Git/build/Xcode-DebugAssert/swift-macosx-x86_64/Debug/bin/lldb-moduleimport-test normal x86_64
  Ld /Users/bknope/Documents/Development/HomeDev/SwiftOpenSource/Git/build/Xcode-DebugAssert/swift-macosx-x86_64/Debug/bin/sil-extract normal x86_64
  Ld /Users/bknope/Documents/Development/HomeDev/SwiftOpenSource/Git/build/Xcode-DebugAssert/swift-macosx-x86_64/Debug/lib/libsourcekitdInProc.dylib normal x86_64
  Ld /Users/bknope/Documents/Development/HomeDev/SwiftOpenSource/Git/build/Xcode-DebugAssert/swift-macosx-x86_64/Debug/lib/sourcekitd.framework/Versions/A/XPCServices/SourceKitService.xpc/Contents/MacOS/SourceKitService normal x86_64
  Ld /Users/bknope/Documents/Development/HomeDev/SwiftOpenSource/Git/build/Xcode-DebugAssert/swift-macosx-x86_64/Debug/bin/sil-opt normal x86_64
  Ld /Users/bknope/Documents/Development/HomeDev/SwiftOpenSource/Git/build/Xcode-DebugAssert/swift-macosx-x86_64/Debug/bin/swift normal x86_64
  PhaseScriptExecution CMake\ Rules /Users/bknope/Documents/Development/HomeDev/SwiftOpenSource/Git/build/Xcode-DebugAssert/swift-macosx-x86_64/stdlib/public/core/Swift.build/Debug/swiftCore-macosx-x86_64.build/Script-108636DE8CFD466696B1E543.sh
  Ld /Users/bknope/Documents/Development/HomeDev/SwiftOpenSource/Git/build/Xcode-DebugAssert/swift-macosx-x86_64/Debug/lib/swift/macosx/x86_64/libswiftCore.dylib normal x86_64
  PhaseScriptExecution CMake\ Rules /Users/bknope/Documents/Development/HomeDev/SwiftOpenSource/Git/build/Xcode-DebugAssert/swift-macosx-x86_64/stdlib/public/SDK/Darwin/Swift.build/Debug/swiftDarwin-macosx-x86_64.build/Script-7B22BCBEE10C4A98AADFC1C6.sh
  Ld /Users/bknope/Documents/Development/HomeDev/SwiftOpenSource/Git/build/Xcode-DebugAssert/swift-macosx-x86_64/Debug/lib/swift/macosx/x86_64/libswiftDarwin.dylib normal x86_64
  PhaseScriptExecution CMake\ Rules /Users/bknope/Documents/Development/HomeDev/SwiftOpenSource/Git/build/Xcode-DebugAssert/swift-macosx-x86_64/stdlib/public/core/Swift.build/Debug/swiftCore-macosx.build/Script-271CB9F29939442FA7136E13.sh
  PhaseScriptExecution CMake\ Rules /Users/bknope/Documents/Development/HomeDev/SwiftOpenSource/Git/build/Xcode-DebugAssert/swift-macosx-x86_64/stdlib/public/SDK/IOKit/Swift.build/Debug/swiftIOKit-macosx-x86_64.build/Script-3F9302E9105C466A9C407335.sh
  Ld /Users/bknope/Documents/Development/HomeDev/SwiftOpenSource/Git/build/Xcode-DebugAssert/swift-macosx-x86_64/Debug/lib/swift/macosx/x86_64/libswiftIOKit.dylib normal x86_64
  PhaseScriptExecution CMake\ Rules /Users/bknope/Documents/Development/HomeDev/SwiftOpenSource/Git/build/Xcode-DebugAssert/swift-macosx-x86_64/stdlib/internal/SwiftExperimental/Swift.build/Debug/swiftSwiftExperimental-macosx-x86_64.build/Script-717669C8E17E4F6094C04BF7.sh
  Ld /Users/bknope/Documents/Development/HomeDev/SwiftOpenSource/Git/build/Xcode-DebugAssert/swift-macosx-x86_64/Debug/lib/swift/macosx/x86_64/libswiftSwiftExperimental.dylib normal x86_64
  PhaseScriptExecution CMake\ Rules /Users/bknope/Documents/Development/HomeDev/SwiftOpenSource/Git/build/Xcode-DebugAssert/swift-macosx-x86_64/stdlib/private/SwiftPrivate/Swift.build/Debug/swiftSwiftPrivate-macosx-x86_64.build/Script-96060ACCDC4546F6BFEC0CE6.sh
  Ld /Users/bknope/Documents/Development/HomeDev/SwiftOpenSource/Git/build/Xcode-DebugAssert/swift-macosx-x86_64/Debug/lib/swift/macosx/x86_64/libswiftSwiftPrivate.dylib normal x86_64
  PhaseScriptExecution CMake\ Rules /Users/bknope/Documents/Development/HomeDev/SwiftOpenSource/Git/build/Xcode-DebugAssert/swift-macosx-x86_64/stdlib/public/SDK/IOKit/Swift.build/Debug/swiftIOKit-macosx.build/Script-239BA365810C448D94605F9D.sh
  PhaseScriptExecution CMake\ Rules /Users/bknope/Documents/Development/HomeDev/SwiftOpenSource/Git/build/Xcode-DebugAssert/swift-macosx-x86_64/stdlib/internal/SwiftExperimental/Swift.build/Debug/swiftSwiftExperimental-macosx.build/Script-271CD60B97A3431DA346C852.sh
  PhaseScriptExecution CMake\ Rules /Users/bknope/Documents/Development/HomeDev/SwiftOpenSource/Git/build/Xcode-DebugAssert/swift-macosx-x86_64/stdlib/private/SwiftPrivate/Swift.build/Debug/swiftSwiftPrivate-macosx.build/Script-C96FADAE1808405DB5AA357A.sh
  PhaseScriptExecution CMake\ Rules /Users/bknope/Documents/Development/HomeDev/SwiftOpenSource/Git/build/Xcode-DebugAssert/swift-macosx-x86_64/stdlib/private/SwiftPrivatePthreadExtras/Swift.build/Debug/swiftSwiftPrivatePthreadExtras-macosx-x86_64.build/Script-CD43D74025C64F3E85846AC6.sh
  Ld /Users/bknope/Documents/Development/HomeDev/SwiftOpenSource/Git/build/Xcode-DebugAssert/swift-macosx-x86_64/Debug/lib/swift/macosx/x86_64/libswiftSwiftPrivatePthreadExtras.dylib normal x86_64
  PhaseScriptExecution CMake\ Rules /Users/bknope/Documents/Development/HomeDev/SwiftOpenSource/Git/build/Xcode-DebugAssert/swift-macosx-x86_64/stdlib/public/SDK/simd/Swift.build/Debug/swiftsimd-macosx-x86_64.build/Script-542BA85D65374A2ABDD7C3CE.sh
  Ld /Users/bknope/Documents/Development/HomeDev/SwiftOpenSource/Git/build/Xcode-DebugAssert/swift-macosx-x86_64/Debug/lib/swift/macosx/x86_64/libswiftsimd.dylib normal x86_64
  PhaseScriptExecution CMake\ Rules /Users/bknope/Documents/Development/HomeDev/SwiftOpenSource/Git/build/Xcode-DebugAssert/swift-macosx-x86_64/stdlib/public/SDK/Darwin/Swift.build/Debug/swiftDarwin-macosx.build/Script-87A99B225A1D401AA3FFA6D7.sh
  PhaseScriptExecution CMake\ Rules /Users/bknope/Documents/Development/HomeDev/SwiftOpenSource/Git/build/Xcode-DebugAssert/swift-macosx-x86_64/stdlib/public/SDK/ObjectiveC/Swift.build/Debug/swiftObjectiveC-macosx-x86_64.build/Script-51425137CB374D088D4E4897.sh
  Ld /Users/bknope/Documents/Development/HomeDev/SwiftOpenSource/Git/build/Xcode-DebugAssert/swift-macosx-x86_64/Debug/lib/swift/macosx/x86_64/libswiftObjectiveC.dylib normal x86_64
  PhaseScriptExecution CMake\ Rules /Users/bknope/Documents/Development/HomeDev/SwiftOpenSource/Git/build/Xcode-DebugAssert/swift-macosx-x86_64/stdlib/private/SwiftPrivateDarwinExtras/Swift.build/Debug/swiftSwiftPrivateDarwinExtras-macosx-x86_64.build/Script-DA46809C39B14464B8DC0D8D.sh
  Ld /Users/bknope/Documents/Development/HomeDev/SwiftOpenSource/Git/build/Xcode-DebugAssert/swift-macosx-x86_64/Debug/lib/swift/macosx/x86_64/libswiftSwiftPrivateDarwinExtras.dylib normal x86_64
  PhaseScriptExecution CMake\ Rules /Users/bknope/Documents/Development/HomeDev/SwiftOpenSource/Git/build/Xcode-DebugAssert/swift-macosx-x86_64/stdlib/public/SDK/ObjectiveC/Swift.build/Debug/swiftObjectiveC-macosx.build/Script-9A81870A9969469D8071C8AC.sh
  PhaseScriptExecution CMake\ Rules /Users/bknope/Documents/Development/HomeDev/SwiftOpenSource/Git/build/Xcode-DebugAssert/swift-macosx-x86_64/stdlib/public/SDK/Dispatch/Swift.build/Debug/swiftDispatch-macosx-x86_64.build/Script-044C6414519E46BB8EFC9478.sh
  Ld /Users/bknope/Documents/Development/HomeDev/SwiftOpenSource/Git/build/Xcode-DebugAssert/swift-macosx-x86_64/Debug/lib/swift/macosx/x86_64/libswiftDispatch.dylib normal x86_64
  PhaseScriptExecution CMake\ Rules /Users/bknope/Documents/Development/HomeDev/SwiftOpenSource/Git/build/Xcode-DebugAssert/swift-macosx-x86_64/stdlib/private/SwiftPrivatePthreadExtras/Swift.build/Debug/swiftSwiftPrivatePthreadExtras-macosx.build/Script-00026F3C06974CDDBCAE52E5.sh
  PhaseScriptExecution CMake\ Rules /Users/bknope/Documents/Development/HomeDev/SwiftOpenSource/Git/build/Xcode-DebugAssert/swift-macosx-x86_64/stdlib/private/SwiftPrivateDarwinExtras/Swift.build/Debug/swiftSwiftPrivateDarwinExtras-macosx.build/Script-787BD93A208C48CBA3676558.sh
  PhaseScriptExecution CMake\ Rules /Users/bknope/Documents/Development/HomeDev/SwiftOpenSource/Git/build/Xcode-DebugAssert/swift-macosx-x86_64/stdlib/public/SDK/simd/Swift.build/Debug/swiftsimd-macosx.build/Script-FFF6C5EF071641328AEF2008.sh
  PhaseScriptExecution CMake\ Rules /Users/bknope/Documents/Development/HomeDev/SwiftOpenSource/Git/build/Xcode-DebugAssert/swift-macosx-x86_64/stdlib/public/SDK/OpenCL/Swift.build/Debug/swiftOpenCL-macosx-x86_64.build/Script-DE06A1493DF2492C880DCA8D.sh
  Ld /Users/bknope/Documents/Development/HomeDev/SwiftOpenSource/Git/build/Xcode-DebugAssert/swift-macosx-x86_64/Debug/lib/swift/macosx/x86_64/libswiftOpenCL.dylib normal x86_64
  PhaseScriptExecution CMake\ Rules /Users/bknope/Documents/Development/HomeDev/SwiftOpenSource/Git/build/Xcode-DebugAssert/swift-macosx-x86_64/stdlib/public/SDK/Dispatch/Swift.build/Debug/swiftDispatch-macosx.build/Script-C745C924C6224783A22824FA.sh
  PhaseScriptExecution CMake\ Rules /Users/bknope/Documents/Development/HomeDev/SwiftOpenSource/Git/build/Xcode-DebugAssert/swift-macosx-x86_64/stdlib/public/SDK/CoreAudio/Swift.build/Debug/swiftCoreAudio-macosx-x86_64.build/Script-90E9401695D34C7680D33BD1.sh
  Ld /Users/bknope/Documents/Development/HomeDev/SwiftOpenSource/Git/build/Xcode-DebugAssert/swift-macosx-x86_64/Debug/lib/swift/macosx/x86_64/libswiftCoreAudio.dylib normal x86_64
  PhaseScriptExecution CMake\ Rules /Users/bknope/Documents/Development/HomeDev/SwiftOpenSource/Git/build/Xcode-DebugAssert/swift-macosx-x86_64/stdlib/public/SDK/CoreGraphics/Swift.build/Debug/swiftCoreGraphics-macosx-x86_64.build/Script-2AECC983853743AD98003973.sh
  Ld /Users/bknope/Documents/Development/HomeDev/SwiftOpenSource/Git/build/Xcode-DebugAssert/swift-macosx-x86_64/Debug/lib/swift/macosx/x86_64/libswiftCoreGraphics.dylib normal x86_64
  PhaseScriptExecution CMake\ Rules /Users/bknope/Documents/Development/HomeDev/SwiftOpenSource/Git/build/Xcode-DebugAssert/swift-macosx-x86_64/stdlib/public/SDK/OpenCL/Swift.build/Debug/swiftOpenCL-macosx.build/Script-2E7996ED4B254B0D8A6CBF19.sh
  PhaseScriptExecution CMake\ Rules /Users/bknope/Documents/Development/HomeDev/SwiftOpenSource/Git/build/Xcode-DebugAssert/swift-macosx-x86_64/stdlib/public/SDK/CoreAudio/Swift.build/Debug/swiftCoreAudio-macosx.build/Script-CF13954B96354FA58931F9DA.sh
  PhaseScriptExecution CMake\ Rules /Users/bknope/Documents/Development/HomeDev/SwiftOpenSource/Git/build/Xcode-DebugAssert/swift-macosx-x86_64/stdlib/public/SDK/CoreGraphics/Swift.build/Debug/swiftCoreGraphics-macosx.build/Script-654C01DFA8E74EE68DC02A86.sh
  PhaseScriptExecution CMake\ Rules /Users/bknope/Documents/Development/HomeDev/SwiftOpenSource/Git/build/Xcode-DebugAssert/swift-macosx-x86_64/stdlib/public/SDK/Foundation/Swift.build/Debug/swiftFoundation-macosx-x86_64.build/Script-3CCE623331CD4B5FB12F6944.sh
  Ld /Users/bknope/Documents/Development/HomeDev/SwiftOpenSource/Git/build/Xcode-DebugAssert/swift-macosx-x86_64/Debug/lib/swift/macosx/x86_64/libswiftFoundation.dylib normal x86_64
  PhaseScriptExecution CMake\ Rules /Users/bknope/Documents/Development/HomeDev/SwiftOpenSource/Git/build/Xcode-DebugAssert/swift-macosx-x86_64/stdlib/public/SDK/GameplayKit/Swift.build/Debug/swiftGameplayKit-macosx-x86_64.build/Script-59A41D742DA2452DAF6AE082.sh
  Ld /Users/bknope/Documents/Development/HomeDev/SwiftOpenSource/Git/build/Xcode-DebugAssert/swift-macosx-x86_64/Debug/lib/swift/macosx/x86_64/libswiftGameplayKit.dylib normal x86_64
  PhaseScriptExecution CMake\ Rules /Users/bknope/Documents/Development/HomeDev/SwiftOpenSource/Git/build/Xcode-DebugAssert/swift-macosx-x86_64/stdlib/private/StdlibUnittestFoundationExtras/Swift.build/Debug/swiftStdlibUnittestFoundationExtras-macosx-x86_64.build/Script-162ACCE0ABB248798402555C.sh
  Ld /Users/bknope/Documents/Development/HomeDev/SwiftOpenSource/Git/build/Xcode-DebugAssert/swift-macosx-x86_64/Debug/lib/swift/macosx/x86_64/libswiftStdlibUnittestFoundationExtras.dylib normal x86_64
  PhaseScriptExecution CMake\ Rules /Users/bknope/Documents/Development/HomeDev/SwiftOpenSource/Git/build/Xcode-DebugAssert/swift-macosx-x86_64/stdlib/public/SDK/LocalAuthentication/Swift.build/Debug/swiftLocalAuthentication-macosx-x86_64.build/Script-4D0305FE6A6E497FBE051D35.sh
  Ld /Users/bknope/Documents/Development/HomeDev/SwiftOpenSource/Git/build/Xcode-DebugAssert/swift-macosx-x86_64/Debug/lib/swift/macosx/x86_64/libswiftLocalAuthentication.dylib normal x86_64
  PhaseScriptExecution CMake\ Rules /Users/bknope/Documents/Development/HomeDev/SwiftOpenSource/Git/build/Xcode-DebugAssert/swift-macosx-x86_64/stdlib/public/SDK/Contacts/Swift.build/Debug/swiftContacts-macosx-x86_64.build/Script-F52F72331F6F4629B6241C84.sh
  Ld /Users/bknope/Documents/Development/HomeDev/SwiftOpenSource/Git/build/Xcode-DebugAssert/swift-macosx-x86_64/Debug/lib/swift/macosx/x86_64/libswiftContacts.dylib normal x86_64
  PhaseScriptExecution CMake\ Rules /Users/bknope/Documents/Development/HomeDev/SwiftOpenSource/Git/build/Xcode-DebugAssert/swift-macosx-x86_64/stdlib/public/SDK/CoreData/Swift.build/Debug/swiftCoreData-macosx-x86_64.build/Script-042FD4EDF85140C1ADD27532.sh
  Ld /Users/bknope/Documents/Development/HomeDev/SwiftOpenSource/Git/build/Xcode-DebugAssert/swift-macosx-x86_64/Debug/lib/swift/macosx/x86_64/libswiftCoreData.dylib normal x86_64
  PhaseScriptExecution CMake\ Rules /Users/bknope/Documents/Development/HomeDev/SwiftOpenSource/Git/build/Xcode-DebugAssert/swift-macosx-x86_64/stdlib/public/SDK/CoreImage/Swift.build/Debug/swiftCoreImage-macosx-x86_64.build/Script-95ADBB3CC1A2487B8EAD683E.sh
  Ld /Users/bknope/Documents/Development/HomeDev/SwiftOpenSource/Git/build/Xcode-DebugAssert/swift-macosx-x86_64/Debug/lib/swift/macosx/x86_64/libswiftCoreImage.dylib normal x86_64
  PhaseScriptExecution CMake\ Rules /Users/bknope/Documents/Development/HomeDev/SwiftOpenSource/Git/build/Xcode-DebugAssert/swift-macosx-x86_64/stdlib/public/SDK/CoreLocation/Swift.build/Debug/swiftCoreLocation-macosx-x86_64.build/Script-BD67FD71355E4ECDAB4F168D.sh
  Ld /Users/bknope/Documents/Development/HomeDev/SwiftOpenSource/Git/build/Xcode-DebugAssert/swift-macosx-x86_64/Debug/lib/swift/macosx/x86_64/libswiftCoreLocation.dylib normal x86_64
  PhaseScriptExecution CMake\ Rules /Users/bknope/Documents/Development/HomeDev/SwiftOpenSource/Git/build/Xcode-DebugAssert/swift-macosx-x86_64/stdlib/public/SDK/Contacts/Swift.build/Debug/swiftContacts-macosx.build/Script-C2FB8D05EDE5488E9260EA60.sh
  PhaseScriptExecution CMake\ Rules /Users/bknope/Documents/Development/HomeDev/SwiftOpenSource/Git/build/Xcode-DebugAssert/swift-macosx-x86_64/stdlib/public/SDK/CoreBluetooth/Swift.build/Debug/swiftCoreBluetooth-macosx-x86_64.build/Script-1BB53553927C4AC18373239E.sh
  Ld /Users/bknope/Documents/Development/HomeDev/SwiftOpenSource/Git/build/Xcode-DebugAssert/swift-macosx-x86_64/Debug/lib/swift/macosx/x86_64/libswiftCoreBluetooth.dylib normal x86_64
  PhaseScriptExecution CMake\ Rules /Users/bknope/Documents/Development/HomeDev/SwiftOpenSource/Git/build/Xcode-DebugAssert/swift-macosx-x86_64/stdlib/public/SDK/CoreData/Swift.build/Debug/swiftCoreData-macosx.build/Script-6D463AB608D54B66A717065D.sh
  PhaseScriptExecution CMake\ Rules /Users/bknope/Documents/Development/HomeDev/SwiftOpenSource/Git/build/Xcode-DebugAssert/swift-macosx-x86_64/stdlib/public/SDK/AppKit/Swift.build/Debug/swiftAppKit-macosx-x86_64.build/Script-4E5B318A61D445F0AE02E153.sh
  Ld /Users/bknope/Documents/Development/HomeDev/SwiftOpenSource/Git/build/Xcode-DebugAssert/swift-macosx-x86_64/Debug/lib/swift/macosx/x86_64/libswiftAppKit.dylib normal x86_64
  PhaseScriptExecution CMake\ Rules /Users/bknope/Documents/Development/HomeDev/SwiftOpenSource/Git/build/Xcode-DebugAssert/swift-macosx-x86_64/stdlib/public/SDK/CoreImage/Swift.build/Debug/swiftCoreImage-macosx.build/Script-7F6B6F1B1D404E3AAE12BFE3.sh
  PhaseScriptExecution CMake\ Rules /Users/bknope/Documents/Development/HomeDev/SwiftOpenSource/Git/build/Xcode-DebugAssert/swift-macosx-x86_64/stdlib/public/SDK/CloudKit/Swift.build/Debug/swiftCloudKit-macosx-x86_64.build/Script-C900B15703D94711B1080B5E.sh
  Ld /Users/bknope/Documents/Development/HomeDev/SwiftOpenSource/Git/build/Xcode-DebugAssert/swift-macosx-x86_64/Debug/lib/swift/macosx/x86_64/libswiftCloudKit.dylib normal x86_64
  PhaseScriptExecution CMake\ Rules /Users/bknope/Documents/Development/HomeDev/SwiftOpenSource/Git/build/Xcode-DebugAssert/swift-macosx-x86_64/stdlib/public/SDK/CoreLocation/Swift.build/Debug/swiftCoreLocation-macosx.build/Script-AE82185A4C24443BB9CDC0ED.sh
  PhaseScriptExecution CMake\ Rules /Users/bknope/Documents/Development/HomeDev/SwiftOpenSource/Git/build/Xcode-DebugAssert/swift-macosx-x86_64/stdlib/public/SDK/Foundation/Swift.build/Debug/swiftFoundation-macosx.build/Script-D10071D4B53347529E14D73C.sh
  PhaseScriptExecution CMake\ Rules /Users/bknope/Documents/Development/HomeDev/SwiftOpenSource/Git/build/Xcode-DebugAssert/swift-macosx-x86_64/stdlib/public/SDK/LocalAuthentication/Swift.build/Debug/swiftLocalAuthentication-macosx.build/Script-D54931C0E9CE4F389BEB5775.sh
  PhaseScriptExecution CMake\ Rules /Users/bknope/Documents/Development/HomeDev/SwiftOpenSource/Git/build/Xcode-DebugAssert/swift-macosx-x86_64/stdlib/private/StdlibUnittest/Swift.build/Debug/swiftStdlibUnittest-macosx-x86_64.build/Script-11C0AD88EB8641D1920C84B5.sh
  Ld /Users/bknope/Documents/Development/HomeDev/SwiftOpenSource/Git/build/Xcode-DebugAssert/swift-macosx-x86_64/Debug/lib/swift/macosx/x86_64/libswiftStdlibUnittest.dylib normal x86_64
  PhaseScriptExecution CMake\ Rules /Users/bknope/Documents/Development/HomeDev/SwiftOpenSource/Git/build/Xcode-DebugAssert/swift-macosx-x86_64/stdlib/private/StdlibUnittestFoundationExtras/Swift.build/Debug/swiftStdlibUnittestFoundationExtras-macosx.build/Script-43B303FB83F04C03993BE419.sh
  PhaseScriptExecution CMake\ Rules /Users/bknope/Documents/Development/HomeDev/SwiftOpenSource/Git/build/Xcode-DebugAssert/swift-macosx-x86_64/stdlib/public/SDK/CoreBluetooth/Swift.build/Debug/swiftCoreBluetooth-macosx.build/Script-E25711D37914441A9CBBED12.sh
  PhaseScriptExecution CMake\ Rules /Users/bknope/Documents/Development/HomeDev/SwiftOpenSource/Git/build/Xcode-DebugAssert/swift-macosx-x86_64/stdlib/public/SDK/EventKit/Swift.build/Debug/swiftEventKit-macosx-x86_64.build/Script-3538D4A4B8EE49D784EA4643.sh
  Ld /Users/bknope/Documents/Development/HomeDev/SwiftOpenSource/Git/build/Xcode-DebugAssert/swift-macosx-x86_64/Debug/lib/swift/macosx/x86_64/libswiftEventKit.dylib normal x86_64
  PhaseScriptExecution CMake\ Rules /Users/bknope/Documents/Development/HomeDev/SwiftOpenSource/Git/build/Xcode-DebugAssert/swift-macosx-x86_64/stdlib/public/SDK/WebKit/Swift.build/Debug/swiftWebKit-macosx-x86_64.build/Script-016C9C2674E24D5AAE824AC0.sh
  Ld /Users/bknope/Documents/Development/HomeDev/SwiftOpenSource/Git/build/Xcode-DebugAssert/swift-macosx-x86_64/Debug/lib/swift/macosx/x86_64/libswiftWebKit.dylib normal x86_64
  PhaseScriptExecution CMake\ Rules /Users/bknope/Documents/Development/HomeDev/SwiftOpenSource/Git/build/Xcode-DebugAssert/swift-macosx-x86_64/stdlib/public/SDK/AppKit/Swift.build/Debug/swiftAppKit-macosx.build/Script-0BBD02D10B9D48759CF32DDA.sh
  PhaseScriptExecution CMake\ Rules /Users/bknope/Documents/Development/HomeDev/SwiftOpenSource/Git/build/Xcode-DebugAssert/swift-macosx-x86_64/stdlib/public/SDK/CoreMedia/Swift.build/Debug/swiftCoreMedia-macosx-x86_64.build/Script-32CCE73E1EAD4E419FC18EFD.sh
  Ld /Users/bknope/Documents/Development/HomeDev/SwiftOpenSource/Git/build/Xcode-DebugAssert/swift-macosx-x86_64/Debug/lib/swift/macosx/x86_64/libswiftCoreMedia.dylib normal x86_64
  PhaseScriptExecution CMake\ Rules /Users/bknope/Documents/Development/HomeDev/SwiftOpenSource/Git/build/Xcode-DebugAssert/swift-macosx-x86_64/stdlib/public/SDK/CloudKit/Swift.build/Debug/swiftCloudKit-macosx.build/Script-387F71FC160249FDAF723F4A.sh
  PhaseScriptExecution CMake\ Rules /Users/bknope/Documents/Development/HomeDev/SwiftOpenSource/Git/build/Xcode-DebugAssert/swift-macosx-x86_64/stdlib/public/SDK/GLKit/Swift.build/Debug/swiftGLKit-macosx-x86_64.build/Script-E4D7DE46F06145BEAAB41A0C.sh
  Ld /Users/bknope/Documents/Development/HomeDev/SwiftOpenSource/Git/build/Xcode-DebugAssert/swift-macosx-x86_64/Debug/lib/swift/macosx/x86_64/libswiftGLKit.dylib normal x86_64
  PhaseScriptExecution CMake\ Rules /Users/bknope/Documents/Development/HomeDev/SwiftOpenSource/Git/build/Xcode-DebugAssert/swift-macosx-x86_64/stdlib/public/SDK/MultipeerConnectivity/Swift.build/Debug/swiftMultipeerConnectivity-macosx-x86_64.build/Script-246235CAEA2B4182A5202234.sh
  Ld /Users/bknope/Documents/Development/HomeDev/SwiftOpenSource/Git/build/Xcode-DebugAssert/swift-macosx-x86_64/Debug/lib/swift/macosx/x86_64/libswiftMultipeerConnectivity.dylib normal x86_64
  PhaseScriptExecution CMake\ Rules /Users/bknope/Documents/Development/HomeDev/SwiftOpenSource/Git/build/Xcode-DebugAssert/swift-macosx-x86_64/stdlib/public/SDK/EventKit/Swift.build/Debug/swiftEventKit-macosx.build/Script-3695BE6F2CCF42ADB2D6EF80.sh
  PhaseScriptExecution CMake\ Rules /Users/bknope/Documents/Development/HomeDev/SwiftOpenSource/Git/build/Xcode-DebugAssert/swift-macosx-x86_64/stdlib/public/SDK/WebKit/Swift.build/Debug/swiftWebKit-macosx.build/Script-CBB6B1C00A27445FB9DDA635.sh
  PhaseScriptExecution CMake\ Rules /Users/bknope/Documents/Development/HomeDev/SwiftOpenSource/Git/build/Xcode-DebugAssert/swift-macosx-x86_64/stdlib/public/SDK/AVFoundation/Swift.build/Debug/swiftAVFoundation-macosx-x86_64.build/Script-57700F74603D481C9705E0FA.sh
  Ld /Users/bknope/Documents/Development/HomeDev/SwiftOpenSource/Git/build/Xcode-DebugAssert/swift-macosx-x86_64/Debug/lib/swift/macosx/x86_64/libswiftAVFoundation.dylib normal x86_64
  PhaseScriptExecution CMake\ Rules /Users/bknope/Documents/Development/HomeDev/SwiftOpenSource/Git/build/Xcode-DebugAssert/swift-macosx-x86_64/stdlib/public/SDK/CoreMedia/Swift.build/Debug/swiftCoreMedia-macosx.build/Script-97B7138D4DC64B959865E462.sh
  PhaseScriptExecution CMake\ Rules /Users/bknope/Documents/Development/HomeDev/SwiftOpenSource/Git/build/Xcode-DebugAssert/swift-macosx-x86_64/stdlib/public/SDK/XCTest/Swift.build/Debug/swiftXCTest-macosx-x86_64.build/Script-3DD3FAA1201345138FADC625.sh
  Ld /Users/bknope/Documents/Development/HomeDev/SwiftOpenSource/Git/build/Xcode-DebugAssert/swift-macosx-x86_64/Debug/lib/swift/macosx/x86_64/libswiftXCTest.dylib normal x86_64
  PhaseScriptExecution CMake\ Rules /Users/bknope/Documents/Development/HomeDev/SwiftOpenSource/Git/build/Xcode-DebugAssert/swift-macosx-x86_64/stdlib/public/SDK/SceneKit/Swift.build/Debug/swiftSceneKit-macosx-x86_64.build/Script-E0176BA8E09C4593803D0410.sh
  Ld /Users/bknope/Documents/Development/HomeDev/SwiftOpenSource/Git/build/Xcode-DebugAssert/swift-macosx-x86_64/Debug/lib/swift/macosx/x86_64/libswiftSceneKit.dylib normal x86_64
  PhaseScriptExecution CMake\ Rules /Users/bknope/Documents/Development/HomeDev/SwiftOpenSource/Git/build/Xcode-DebugAssert/swift-macosx-x86_64/stdlib/public/SDK/GLKit/Swift.build/Debug/swiftGLKit-macosx.build/Script-F881131BAAE84DAA865DEC6C.sh
  PhaseScriptExecution CMake\ Rules /Users/bknope/Documents/Development/HomeDev/SwiftOpenSource/Git/build/Xcode-DebugAssert/swift-macosx-x86_64/stdlib/public/SDK/MultipeerConnectivity/Swift.build/Debug/swiftMultipeerConnectivity-macosx.build/Script-FE9C57C3ECF44371A8B76218.sh
  PhaseScriptExecution CMake\ Rules /Users/bknope/Documents/Development/HomeDev/SwiftOpenSource/Git/build/Xcode-DebugAssert/swift-macosx-x86_64/stdlib/public/SDK/SpriteKit/Swift.build/Debug/swiftSpriteKit-macosx-x86_64.build/Script-C5D94199FE9F4BD88E3544D6.sh
  Ld /Users/bknope/Documents/Development/HomeDev/SwiftOpenSource/Git/build/Xcode-DebugAssert/swift-macosx-x86_64/Debug/lib/swift/macosx/x86_64/libswiftSpriteKit.dylib normal x86_64
  PhaseScriptExecution CMake\ Rules /Users/bknope/Documents/Development/HomeDev/SwiftOpenSource/Git/build/Xcode-DebugAssert/swift-macosx-x86_64/stdlib/public/SDK/AVFoundation/Swift.build/Debug/swiftAVFoundation-macosx.build/Script-556F5098D4E94CA0ABC53809.sh
  PhaseScriptExecution CMake\ Rules /Users/bknope/Documents/Development/HomeDev/SwiftOpenSource/Git/build/Xcode-DebugAssert/swift-macosx-x86_64/stdlib/public/SDK/SpriteKit/Swift.build/Debug/swiftSpriteKit-macosx.build/Script-377F6F205E8E4C949B21056D.sh
  PhaseScriptExecution CMake\ Rules /Users/bknope/Documents/Development/HomeDev/SwiftOpenSource/Git/build/Xcode-DebugAssert/swift-macosx-x86_64/stdlib/private/StdlibUnittest/Swift.build/Debug/swiftStdlibUnittest-macosx.build/Script-828CE8660E884AAE9F796678.sh
  PhaseScriptExecution CMake\ Rules /Users/bknope/Documents/Development/HomeDev/SwiftOpenSource/Git/build/Xcode-DebugAssert/swift-macosx-x86_64/stdlib/public/SDK/GameplayKit/Swift.build/Debug/swiftGameplayKit-macosx.build/Script-7CE7220CB47E477A84EB8C0B.sh
  PhaseScriptExecution CMake\ Rules /Users/bknope/Documents/Development/HomeDev/SwiftOpenSource/Git/build/Xcode-DebugAssert/swift-macosx-x86_64/stdlib/public/SDK/XCTest/Swift.build/Debug/swiftXCTest-macosx.build/Script-36C1BC0D25E94297BE7C7859.sh
  PhaseScriptExecution CMake\ Rules /Users/bknope/Documents/Development/HomeDev/SwiftOpenSource/Git/build/Xcode-DebugAssert/swift-macosx-x86_64/stdlib/public/SDK/SceneKit/Swift.build/Debug/swiftSceneKit-macosx.build/Script-494BBCA3D7A1414DA2308550.sh
  PhaseScriptExecution CMake\ Rules /Users/bknope/Documents/Development/HomeDev/SwiftOpenSource/Git/build/Xcode-DebugAssert/swift-macosx-x86_64/stdlib/public/SDK/GameKit/Swift.build/Debug/swiftGameKit-macosx-x86_64.build/Script-4BC96D32DB7E43D1938EB9E2.sh
  Ld /Users/bknope/Documents/Development/HomeDev/SwiftOpenSource/Git/build/Xcode-DebugAssert/swift-macosx-x86_64/Debug/lib/swift/macosx/x86_64/libswiftGameKit.dylib normal x86_64
  PhaseScriptExecution CMake\ Rules /Users/bknope/Documents/Development/HomeDev/SwiftOpenSource/Git/build/Xcode-DebugAssert/swift-macosx-x86_64/stdlib/public/SDK/GameKit/Swift.build/Debug/swiftGameKit-macosx.build/Script-D08BD42C229647E8A6F0800C.sh
  PhaseScriptExecution CMake\ Rules /Users/bknope/Documents/Development/HomeDev/SwiftOpenSource/Git/build/Xcode-DebugAssert/swift-macosx-x86_64/benchmark/Swift.build/Debug/copy-swift-stdlib-macosx.build/Script-6123874275E445EBA65B0733.sh
  PhaseScriptExecution CMake\ Rules /Users/bknope/Documents/Development/HomeDev/SwiftOpenSource/Git/build/Xcode-DebugAssert/swift-macosx-x86_64/benchmark/Swift.build/Debug/adhoc-sign-swift-stdlib-macosx.build/Script-F69D111B301F49C79B3006FD.sh
  PhaseScriptExecution CMake\ Rules /Users/bknope/Documents/Development/HomeDev/SwiftOpenSource/Git/build/Xcode-DebugAssert/swift-macosx-x86_64/benchmark/Swift.build/Debug/swift-benchmark-macosx-x86_64.build/Script-695805E50356498784EBF144.sh
  PhaseScriptExecution CMake\ PostBuild\ Rules /Users/bknope/Documents/Development/HomeDev/SwiftOpenSource/Git/build/Xcode-DebugAssert/swift-macosx-x86_64/benchmark/Swift.build/Debug/swift-benchmark-macosx-x86_64.build/Script-610D0BE7F85D4C9FB0F611F1.sh
(120 failures)
utils/build-script: command terminated with a non-zero exit status 65, aborting
"

It looks like I can still open Swift.xcodeproj so I’m not sure how serious it is, but I nothing is jumping out at me (i.e. no spaces in my directory names)

Brandon

···

On Feb 17, 2016, at 9:57 PM, Brandon Knope via swift-users <swift-users@swift.org> wrote:

That looks like it did it! I say looks like because it is still building but it has gotten much much further than it ever has.

And the annoying thing is I had just changed “Swift Open Source” to “SwiftOpenSource” after the previous errors and I didn’t see the “Home Dev”.

Any reason why it wouldn’t like spaces?

Thanks a ton!
Brandon

On Feb 17, 2016, at 6:23 PM, Dmitri Gribenko <gribozavr@gmail.com> wrote:

On Wed, Feb 17, 2016 at 2:54 PM, Brandon Knope <bknope@me.com> wrote:

I cloned ninja again and I deleted the build folder. It looks like it’s
getting stuck somewhere else now

Could you try with a directory that does not have spaces in the path?

Dmitri

--
main(i,j){for(i=2;;i++){for(j=2;j<i;j++){if(!(i%j)){j=0;break;}}if
(j){printf("%d\n",i);}}} /*Dmitri Gribenko <gribozavr@gmail.com>*/

_______________________________________________
swift-users mailing list
swift-users@swift.org
https://lists.swift.org/mailman/listinfo/swift-users


(Dmitri Gribenko) #11

The Xcode generator can't be used to build, see build-script --help:

Select the CMake generator:
  -X, --xcode-ide-only use CMake's Xcode generator, with only IDE support (no
                        build)

I recommend to use the default, Ninja, to build. You can use -X for
the IDE experience.

Dmitri

···

On Wed, Feb 17, 2016 at 7:41 PM, Brandon Knope <bknope@me.com> wrote:

Quick update: I ran the command to build for Xcode:

utils/build-scripts -X

And it got some errors toward the end:


** BUILD FAILED **

--
main(i,j){for(i=2;;i++){for(j=2;j<i;j++){if(!(i%j)){j=0;break;}}if
(j){printf("%d\n",i);}}} /*Dmitri Gribenko <gribozavr@gmail.com>*/


(Brandon Knope) #12

Okay awesome! Thank you so much! I really appreciate it

Brandon

···

On Feb 17, 2016, at 10:44 PM, Dmitri Gribenko <gribozavr@gmail.com> wrote:

On Wed, Feb 17, 2016 at 7:41 PM, Brandon Knope <bknope@me.com> wrote:

Quick update: I ran the command to build for Xcode:

utils/build-scripts -X

And it got some errors toward the end:


** BUILD FAILED **

The Xcode generator can't be used to build, see build-script --help:

Select the CMake generator:
-X, --xcode-ide-only use CMake's Xcode generator, with only IDE support (no
                       build)

I recommend to use the default, Ninja, to build. You can use -X for
the IDE experience.

Dmitri

--
main(i,j){for(i=2;;i++){for(j=2;j<i;j++){if(!(i%j)){j=0;break;}}if
(j){printf("%d\n",i);}}} /*Dmitri Gribenko <gribozavr@gmail.com>*/


(Jordan Rose) #13

This is misleading. -x can be used to build, although it will only build for OS X. -X does IDE-only, and should probably go away.

Jordan

···

On Feb 17, 2016, at 19:44, Dmitri Gribenko via swift-users <swift-users@swift.org> wrote:

On Wed, Feb 17, 2016 at 7:41 PM, Brandon Knope <bknope@me.com> wrote:

Quick update: I ran the command to build for Xcode:

utils/build-scripts -X

And it got some errors toward the end:


** BUILD FAILED **

The Xcode generator can't be used to build, see build-script --help:

Select the CMake generator:
-X, --xcode-ide-only use CMake's Xcode generator, with only IDE support (no
                       build)

I recommend to use the default, Ninja, to build. You can use -X for
the IDE experience.


(Brandon Knope) #14

I built with the -x flag and it still had errors:


make: *** [swift-benchmark-macosx-x86_64_buildpart_0] Error 1

** BUILD FAILED **

The following build commands failed:
  PhaseScriptExecution CMake\ Rules /Users/bknope/Documents/Development/HomeDev/SwiftOpenSource/Git/build/Xcode-DebugAssert/swift-macosx-x86_64/Swift.build/Debug/xcode_generate_for_ide_only_dummy.build/Script-19AF2BBC53484AC9B43441A2.sh
  CompileC /Users/bknope/Documents/Development/HomeDev/SwiftOpenSource/Git/build/Xcode-DebugAssert/swift-macosx-x86_64/lib/ClangImporter/Swift.build/Debug/swiftClangImporter.build/Objects-normal/x86_64/ImportDecl.o lib/ClangImporter/ImportDecl.cpp normal x86_64 c++ com.apple.compilers.llvm.clang.1_0.compiler
  Libtool /Users/bknope/Documents/Development/HomeDev/SwiftOpenSource/Git/build/Xcode-DebugAssert/swift-macosx-x86_64/Debug/lib/libswiftClangImporter.a normal x86_64
  Ld /Users/bknope/Documents/Development/HomeDev/SwiftOpenSource/Git/build/Xcode-DebugAssert/swift-macosx-x86_64/Debug/bin/lldb-moduleimport-test normal x86_64
  Ld /Users/bknope/Documents/Development/HomeDev/SwiftOpenSource/Git/build/Xcode-DebugAssert/swift-macosx-x86_64/Debug/bin/swift-llvm-opt normal x86_64
  Ld /Users/bknope/Documents/Development/HomeDev/SwiftOpenSource/Git/build/Xcode-DebugAssert/swift-macosx-x86_64/Debug/bin/swift-ide-test normal x86_64
  Ld /Users/bknope/Documents/Development/HomeDev/SwiftOpenSource/Git/build/Xcode-DebugAssert/swift-macosx-x86_64/Debug/bin/swift normal x86_64
  Ld /Users/bknope/Documents/Development/HomeDev/SwiftOpenSource/Git/build/Xcode-DebugAssert/swift-macosx-x86_64/Debug/bin/sil-opt normal x86_64
  Ld /Users/bknope/Documents/Development/HomeDev/SwiftOpenSource/Git/build/Xcode-DebugAssert/swift-macosx-x86_64/Debug/bin/sil-extract normal x86_64
  Ld /Users/bknope/Documents/Development/HomeDev/SwiftOpenSource/Git/build/Xcode-DebugAssert/swift-macosx-x86_64/Debug/lib/sourcekitd.framework/Versions/A/XPCServices/SourceKitService.xpc/Contents/MacOS/SourceKitService normal x86_64
  Ld /Users/bknope/Documents/Development/HomeDev/SwiftOpenSource/Git/build/Xcode-DebugAssert/swift-macosx-x86_64/Debug/lib/libsourcekitdInProc.dylib normal x86_64
  PhaseScriptExecution CMake\ Rules /Users/bknope/Documents/Development/HomeDev/SwiftOpenSource/Git/build/Xcode-DebugAssert/swift-macosx-x86_64/stdlib/public/core/Swift.build/Debug/swiftCore-macosx-x86_64.build/Script-C79F976947BF4FC68B197DDF.sh
  Ld /Users/bknope/Documents/Development/HomeDev/SwiftOpenSource/Git/build/Xcode-DebugAssert/swift-macosx-

… More that are clipped out …

  PhaseScriptExecution CMake\ Rules /Users/bknope/Documents/Development/HomeDev/SwiftOpenSource/Git/build/Xcode-DebugAssert/swift-macosx-x86_64/stdlib/public/SDK/GameKit/Swift.build/Debug/swiftGameKit-macosx.build/Script-9A57381FBBDA4BE2BC5044CA.sh
  PhaseScriptExecution CMake\ Rules /Users/bknope/Documents/Development/HomeDev/SwiftOpenSource/Git/build/Xcode-DebugAssert/swift-macosx-x86_64/benchmark/Swift.build/Debug/copy-swift-stdlib-macosx.build/Script-583EE90CD65D411E89A1A95C.sh
  PhaseScriptExecution CMake\ Rules /Users/bknope/Documents/Development/HomeDev/SwiftOpenSource/Git/build/Xcode-DebugAssert/swift-macosx-x86_64/benchmark/Swift.build/Debug/adhoc-sign-swift-stdlib-macosx.build/Script-39E097D2B5814E57AE617C72.sh
  PhaseScriptExecution CMake\ Rules /Users/bknope/Documents/Development/HomeDev/SwiftOpenSource/Git/build/Xcode-DebugAssert/swift-macosx-x86_64/benchmark/Swift.build/Debug/swift-benchmark-macosx-x86_64.build/Script-F429CA210C3E428BB0799A93.sh
  PhaseScriptExecution CMake\ PostBuild\ Rules /Users/bknope/Documents/Development/HomeDev/SwiftOpenSource/Git/build/Xcode-DebugAssert/swift-macosx-x86_64/benchmark/Swift.build/Debug/swift-benchmark-macosx-x86_64.build/Script-31C012A16FC14BD48BAEFF45.sh
(120 failures)
utils/build-script: command terminated with a non-zero exit status 65, aborting
"

Should this still be happening with the -x flag then?

Thanks,
Brandon

···

On Feb 18, 2016, at 4:10 PM, Jordan Rose <jordan_rose@apple.com> wrote:

On Feb 17, 2016, at 19:44, Dmitri Gribenko via swift-users <swift-users@swift.org> wrote:

On Wed, Feb 17, 2016 at 7:41 PM, Brandon Knope <bknope@me.com> wrote:

Quick update: I ran the command to build for Xcode:

utils/build-scripts -X

And it got some errors toward the end:


** BUILD FAILED **

The Xcode generator can't be used to build, see build-script --help:

Select the CMake generator:
-X, --xcode-ide-only use CMake's Xcode generator, with only IDE support (no
                      build)

I recommend to use the default, Ninja, to build. You can use -X for
the IDE experience.

This is misleading. -x can be used to build, although it will only build for OS X. -X does IDE-only, and should probably go away.

Jordan


(Jordan Rose) #15

The fact that this line is still in there makes me think you need to blow away your build directory and start again. I don't think anyone's tried mixing -x and -X.

Jordan

Jordan

···

On Feb 19, 2016, at 15:03, Brandon Knope <bknope@me.com> wrote:

  PhaseScriptExecution CMake\ Rules /Users/bknope/Documents/Development/HomeDev/SwiftOpenSource/Git/build/Xcode-DebugAssert/swift-macosx-x86_64/Swift.build/Debug/xcode_generate_for_ide_only_dummy.build/Script-19AF2BBC53484AC9B43441A2.sh


(Brandon Knope) #16

That did it!

Thanks!
Brandon

···

On Feb 19, 2016, at 6:21 PM, Jordan Rose <jordan_rose@apple.com> wrote:

On Feb 19, 2016, at 15:03, Brandon Knope <bknope@me.com> wrote:

  PhaseScriptExecution CMake\ Rules /Users/bknope/Documents/Development/HomeDev/SwiftOpenSource/Git/build/Xcode-DebugAssert/swift-macosx-x86_64/Swift.build/Debug/xcode_generate_for_ide_only_dummy.build/Script-19AF2BBC53484AC9B43441A2.sh

The fact that this line is still in there makes me think you need to blow away your build directory and start again. I don't think anyone's tried mixing -x and -X.

Jordan

Jordan